Target
Polyunsaturated fatty acid 5-lipoxygenase
Ligand
BDBM50044062
Substrate
Meas. Tech.
ChEMBL_3972 (CHEMBL618070)
IC50
1200±n/a nM
Citation
 Unangst, PCConnor, DTCetenko, WASorenson, RJKostlan, CRSircar, JCWright, CDSchrier, DJDyer, RD Synthesis and biological evaluation of 5-[[3,5-bis(1,1-dimethylethyl)- 4-hydroxyphenyl]methylene]oxazoles, -thiazoles, and -imidazoles: novel dual 5-lipoxygenase and cyclooxygenase inhibitors with antiinflammatory activity. J Med Chem 37:322-8 (1994)  
Target
Name:
Polyunsaturated fatty acid 5-lipoxygenase
Synonyms:
Alox5 LOX5_RAT
Type:
PROTEIN
Mol. Mass.:
78082.31
Organism:
Rattus norvegicus
Description:
ChEMBL_1432947
Residue:
673
  
Inhibitor
Name:
BDBM50044062
Synonyms:
5-[1-(3,5-Di-tert-butyl-4-hydroxy-phenyl)-eth-(Z)-ylidene]-4-oxo-4,5-dihydro-thiazol-2-yl-cyanamide | CHEMBL111438
Type:
Small organic molecule
Emp. Form.:
C20H25N3O2S
Mol. Mass.:
371.496
SMILES:
CC(C)(C)c1cc(cc(c1O)C(C)(C)C)C(=C)c1sc(NC#N)nc1O
: