Target
Delta-type opioid receptor
Ligand
BDBM50374634
Substrate
Meas. Tech.
ChEMBL_1330172 (CHEMBL3224074)
Ki
2840±n/a nM
Citation
 Prevatt-Smith, KMLovell, KMSimpson, DSDay, VWDouglas, JTBosch, PDersch, CMRothman, RBKivell, BPrisinzano, TE Potential Drug Abuse Therapeutics Derived from the Hallucinogenic Natural Product Salvinorin A. Medchemcomm 2:1217-1222 (2011)  
Target
Name:
Delta-type opioid receptor
Synonyms:
D-OR-1 Delta opioid receptor OPIATE Delta OPRD1 OPRK1 | opioid receptor, delta 1
Type:
G Protein-Coupled Receptor (GPCR)
Mol. Mass.:
40382.98
Organism:
Homo sapiens (Human)
Description:
Competition binding assays were carried out using membrane preparations from transfected HN9.10 cells that constitutively expressed the delta opioid receptor.
Residue:
372
  
Inhibitor
Name:
BDBM50374634
Synonyms:
CHEMBL258098
Type:
Small organic molecule
Emp. Form.:
C23H30O8
Mol. Mass.:
434.4795
SMILES:
COCO[C@H]1C[C@@H](C(=O)OC)[C@]2(C)CC[C@H]3C(=O)O[C@@H](C[C@]3(C)[C@H]2C1=O)c1ccoc1
: