Target
Mu-type opioid receptor
Ligand
BDBM50374634
Substrate
Meas. Tech.
ChEMBL_1330171 (CHEMBL3224073)
Ki
390±n/a nM
Citation
 Prevatt-Smith, KMLovell, KMSimpson, DSDay, VWDouglas, JTBosch, PDersch, CMRothman, RBKivell, BPrisinzano, TE Potential Drug Abuse Therapeutics Derived from the Hallucinogenic Natural Product Salvinorin A. Medchemcomm 2:1217-1222 (2011)  
Target
Name:
Mu-type opioid receptor
Synonyms:
M-OR-1 MOR-1 MUOR1 Mu opiate receptor OPRM1 hMOP | mu-type opioid receptor isoform MOR-1
Type:
G Protein-Coupled Receptor (GPCR)
Mol. Mass.:
44789.51
Organism:
Homo sapiens (Human)
Description:
P35372
Residue:
400
  
Inhibitor
Name:
BDBM50374634
Synonyms:
CHEMBL258098
Type:
Small organic molecule
Emp. Form.:
C23H30O8
Mol. Mass.:
434.4795
SMILES:
COCO[C@H]1C[C@@H](C(=O)OC)[C@]2(C)CC[C@H]3C(=O)O[C@@H](C[C@]3(C)[C@H]2C1=O)c1ccoc1
: