Target
Type-1 angiotensin II receptor B
Ligand
BDBM50044347
Substrate
Meas. Tech.
ChEBML_34826
IC50
21±n/a nM
Citation
 Huang, HCReitz, DBChamberlain, TSOlins, GMCorpus, VMMcMahon, EGPalomo, MAKoepke, JPSmits, GJMcGraw, DE Synthesis and structure-activity relationships of nonpeptide, potent triazolone-based angiotensin II receptor antagonists. J Med Chem 36:2172-81 (1993)  
Target
Name:
Type-1 angiotensin II receptor B
Synonyms:
AGTRB_RAT Agtr1 Angiotensin II AT1B Angiotensin II type 1b (AT-1b) receptor Type-1B angiotensin II receptor
Type:
Enzyme Catalytic Domain
Mol. Mass.:
40929.44
Organism:
RAT
Description:
Angiotensin II AT1B 0 RAT::P29089
Residue:
359
  
Inhibitor
Name:
BDBM50044347
Synonyms:
5-Butyl-2-[2-(2,5-dimethoxy-phenyl)-2-oxo-ethyl]-4-[2'-(1H-tetrazol-5-yl)-biphenyl-4-ylmethyl]-2,4-dihydro-[1,2,4]triazol-3-one | CHEMBL412664
Type:
Small organic molecule
Emp. Form.:
C30H31N7O4
Mol. Mass.:
553.6116
SMILES:
CCCCc1nn(CC(=O)c2cc(OC)ccc2OC)c(=O)n1Cc1ccc(cc1)-c1ccccc1-c1nnn[nH]1
: