Target
Delta-type/Kappa-type/Mu-type opioid receptor
Ligand
BDBM50497122
Substrate
Meas. Tech.
ChEMBL_1354145 (CHEMBL3280909)
IC50
28±n/a nM
Citation
 DeGraw, JILawson, JACrase, JLJohnson, HLEllis, MUyeno, ETLoew, GHBerkowitz, DS Analgesics. 1. Synthesis and analgesic properties of N-sec-alkyl- and N-tert-alkylnormorphines. J Med Chem 21:415-22 (1978)  
Target
Name:
Delta-type/Kappa-type/Mu-type opioid receptor
Synonyms:
Opioid receptor
Type:
Mol. Mass.:
Description:
ASSAY_ID of ChEMBL is 1935286
Components:
This complex has 3 components.
Component 1
Name:
Delta-type opioid receptor
Synonyms:
Cytochrome P450 3A4 Delta opioid receptor Delta-type opioid receptor (DOR) OPRD_RAT Opioid receptor Opioid receptors; mu & delta Ror-a | Voltage-gated potassium channel
Type:
G Protein-Coupled Receptor (GPCR)
Mol. Mass.:
40465.04
Organism:
Rattus norvegicus (rat)
Description:
Competition binding assays were using CHO-K1 cell membranes expressing the opioid receptor.
Residue:
372
  
Component 2
Name:
Kappa-type opioid receptor
Synonyms:
KOR-1 OPIATE Kappa Opioid receptor Ror-d
Type:
G Protein-Coupled Receptor (GPCR)
Mol. Mass.:
42692.90
Organism:
Rattus norvegicus (rat)
Description:
P34975
Residue:
380
  
Component 3
Name:
Mu-type opioid receptor
Synonyms:
MOR-1 Mu-type opioid receptor (MOR) OPRM_RAT Opioid receptor B Ror-b
Type:
G Protein-Coupled Receptor (GPCR)
Mol. Mass.:
44503.11
Organism:
Rattus norvegicus (rat)
Description:
Competition binding assays were carried out using membrane preparations from transfected HN9.10 cells that constitutively expressed the mu opioid receptor.
Residue:
398
  
Inhibitor
Name:
BDBM50497122
Synonyms:
CHEMBL3275461
Type:
Small organic molecule
Emp. Form.:
C20H25NO3
Mol. Mass.:
327.4174
SMILES:
[H][C@@]12Oc3c4c(C[C@@]5([H])N(CC[C@@]14[C@@]5([H])C=C[C@@H]2O)[C@@H](C)CC)ccc3O
: