Target
Vasopressin V2 receptor
Ligand
BDBM50045137
Substrate
Meas. Tech.
ChEBML_211246
IC50
>50000±n/a nM
Citation
 Ogawa, HYamamura, YMiyamoto, HKondo, KYamashita, HNakaya, KChihara, TMori, TTominaga, MYabuuchi, Y Orally active, nonpeptide vasopressin V1 antagonists. A novel series of 1-(1-substituted 4-piperidyl)-3,4-dihdyro-2(1H)-quinolinone. J Med Chem 36:2011-7 (1993)  
Target
Name:
Vasopressin V2 receptor
Synonyms:
AVPR V2 Avpr2 V2R_RAT Vasopressin receptor
Type:
G-protein coupled receptor
Mol. Mass.:
40761.85
Organism:
Rattus norvegicus (Rat)
Description:
Residue:
371
  
Inhibitor
Name:
BDBM50045137
Synonyms:
1-(1-Methyl-piperidin-4-yl)-3,4-dihydro-1H-quinolin-2-one | CHEMBL305309
Type:
Small organic molecule
Emp. Form.:
C15H20N2O
Mol. Mass.:
244.3321
SMILES:
CN1CCC(CC1)N1C(=O)CCc2ccccc12
: