Target
Acyl-CoA:cholesterol acyltransferase
Ligand
BDBM50045906
Substrate
Meas. Tech.
ChEBML_28349
IC50
6±n/a nM
Citation
 Augelli-Szafran, CEBlankley, CJRoth, BDTrivedi, BKBousley, RFEssenburg, ADHamelehle, KLKrause, BRStanfield, RL Inhibitors of acyl-CoA:cholesterol acyltransferase. 5. Identification and structure-activity relationships of novel beta-ketoamides as hypocholesterolemic agents. J Med Chem 36:2943-9 (1993)  
Target
Name:
Acyl-CoA:cholesterol acyltransferase
Synonyms:
ACAT
Type:
Mol. Mass.:
35405.31
Organism:
Oryctolagus cuniculus
Description:
Residue:
305
  
Inhibitor
Name:
BDBM50045906
Synonyms:
3-Oxo-hexadecanoic acid (2,6-diisopropyl-phenyl)-amide | CHEMBL102026
Type:
Small organic molecule
Emp. Form.:
C28H47NO2
Mol. Mass.:
429.6783
SMILES:
CCCCCCCCCCCCCC(=O)CC(=O)Nc1c(cccc1C(C)C)C(C)C
: