Target
Tyrosine-protein kinase Lck
Ligand
BDBM50040294
Substrate
Meas. Tech.
ChEBML_154444
IC50
60±n/a nM
Citation
 Smyth, MSStefanova, IHorak, IDBurke, TR Hydroxylated 2-(5'-salicyl)naphthalenes as protein-tyrosine kinase inhibitors. J Med Chem 36:3015-20 (1993)  
Target
Name:
Tyrosine-protein kinase Lck
Synonyms:
2.7.10.2 LCK_HUMAN Leukocyte C-terminal Src kinase Lymphocyte-specific protein tyrosine kinase Protein YT16 Proto-oncogene tyrosine-protein kinase LCK T cell-specific protein-tyrosine kinase
Type:
Mol. Mass.:
57987.83
Organism:
Homo sapiens (Human)
Description:
P06239
Residue:
509
  
Inhibitor
Name:
BDBM50040294
Synonyms:
5-[2-(2,5-Dihydroxy-phenyl)-vinyl]-2-hydroxy-benzoic acid | CHEMBL102362
Type:
Small organic molecule
Emp. Form.:
C15H12O5
Mol. Mass.:
272.2528
SMILES:
OC(=O)c1cc(\C=C\c2cc(O)ccc2O)ccc1O
: