Target
Tyrosine-protein kinase Lck
Ligand
BDBM50046062
Substrate
Meas. Tech.
ChEBML_154444
IC50
>200000±n/a nM
Citation
 Smyth, MSStefanova, IHorak, IDBurke, TR Hydroxylated 2-(5'-salicyl)naphthalenes as protein-tyrosine kinase inhibitors. J Med Chem 36:3015-20 (1993)  
Target
Name:
Tyrosine-protein kinase Lck
Synonyms:
2.7.10.2 LCK_HUMAN Leukocyte C-terminal Src kinase Lymphocyte-specific protein tyrosine kinase Protein YT16 Proto-oncogene tyrosine-protein kinase LCK T cell-specific protein-tyrosine kinase
Type:
Mol. Mass.:
57987.83
Organism:
Homo sapiens (Human)
Description:
P06239
Residue:
509
  
Inhibitor
Name:
BDBM50046062
Synonyms:
2-Hydroxy-5-naphthalen-2-yl-benzoic acid | CHEMBL102336
Type:
Small organic molecule
Emp. Form.:
C17H12O3
Mol. Mass.:
264.2754
SMILES:
OC(=O)c1cc(ccc1O)-c1ccc2ccccc2c1
: