Target
Xanthine dehydrogenase/oxidase
Ligand
BDBM50423777
Substrate
Meas. Tech.
ChEMBL_1458550 (CHEMBL3370868)
Ki
35±n/a nM
Citation
 Cao, HPauff, JMHille, R X-ray crystal structure of a xanthine oxidase complex with the flavonoid inhibitor quercetin. J Nat Prod 77:1693-9 (2014)  
Target
Name:
Xanthine dehydrogenase/oxidase
Synonyms:
XD XDHA XO Xanthine dehydrogenase/oxidase | Xanthine oxidase
Type:
Enzyme
Mol. Mass.:
146441.21
Organism:
Homo sapiens (Human)
Description:
P47989
Residue:
1333
  
Inhibitor
Name:
BDBM50423777
Synonyms:
OXYPURINOL | Oxipurinol
Type:
Small organic molecule
Emp. Form.:
C5H4N4O2
Mol. Mass.:
152.1109
SMILES:
O=c1[nH]c2n[nH]cc2c(=O)[nH]1
: