Target
Leukotriene A-4 hydrolase
Ligand
BDBM50046314
Substrate
Meas. Tech.
ChEMBL_96944 (CHEMBL706184)
Ki
46±n/a nM
Citation
 Yuan, WMunoz, BWong, CHHaeggström, JZWetterholm, ASamuelsson, B Development of selective tight-binding inhibitors of leukotriene A4 hydrolase. J Med Chem 36:211-20 (1993)  
Target
Name:
Leukotriene A-4 hydrolase
Synonyms:
LKHA4_HUMAN LTA4 Leukotriene A(4) hydrolase Leukotriene A4 hydrolase
Type:
Hydrolase; metalloprotease
Mol. Mass.:
69280.41
Organism:
Homo sapiens (Human)
Description:
Human recombinant LTA4H.
Residue:
611
  
Inhibitor
Name:
BDBM50046314
Synonyms:
3-Amino-4-(4-benzyloxy-phenyl)-2-oxo-butyric acid benzyl ester | CHEMBL71535
Type:
Small organic molecule
Emp. Form.:
C24H23NO4
Mol. Mass.:
389.4437
SMILES:
N[C@@H](Cc1ccc(OCc2ccccc2)cc1)C(=O)C(=O)OCc1ccccc1
: