Target
Thymidylate synthase
Ligand
BDBM50046651
Substrate
Meas. Tech.
ChEMBL_219324 (CHEMBL823517)
Ki
32±n/a nM
Citation
 Webber, SEBleckman, TMAttard, JDeal, JGKathardekar, VWelsh, KMWebber, SJanson, CAMatthews, DASmith, WW Design of thymidylate synthase inhibitors using protein crystal structures: the synthesis and biological evaluation of a novel class of 5-substituted quinazolinones. J Med Chem 36:733-46 (1993)  
Target
Name:
Thymidylate synthase
Synonyms:
TS TYMS Thymidylate synthase (TS) | Thymidylate synthase/GAR transformylase/AICAR transformylase
Type:
Enzyme
Mol. Mass.:
35718.07
Organism:
Homo sapiens (Human)
Description:
Residue:
313
  
Inhibitor
Name:
BDBM50046651
Synonyms:
2-Amino-5-(2-dimethylamino-pyridin-4-ylsulfanyl)-6-methyl-3H-quinazolin-4-one | CHEMBL351606
Type:
Small organic molecule
Emp. Form.:
C16H17N5OS
Mol. Mass.:
327.404
SMILES:
CN(C)c1cc(Sc2c(C)ccc3nc(N)[nH]c(=O)c23)ccn1
: