Target
Receptor-interacting serine/threonine-protein kinase 1
Ligand
BDBM50502339
Substrate
Meas. Tech.
ChEMBL_1806554 (CHEMBL4305913)
IC50
0.400000±n/a nM
Citation
 Harris, PAMarinis, JMLich, JDBerger, SBChirala, ACox, JAEidam, PMFinger, JNGough, PJJeong, JUKang, JKasparcova, VLeister, LKMahajan, MKMiller, GNagilla, ROuellette, MTReilly, MARendina, ARRivera, EJSun, HHThorpe, JHTotoritis, RDWang, WWu, DZhang, DBertin, JMarquis, RW Identification of a RIP1 Kinase Inhibitor Clinical Candidate (GSK3145095) for the Treatment of Pancreatic Cancer. ACS Med Chem Lett 10:857-862 (2019)  
Target
Name:
Receptor-interacting serine/threonine-protein kinase 1
Synonyms:
Cell death protein RIP RIP-1 RIPK1 Receptor-interacting protein 1
Type:
Enzyme Catalytic Domain
Mol. Mass.:
75926.99
Organism:
Homo sapiens (Human)
Description:
Q13546
Residue:
671
  
Inhibitor
Name:
BDBM50502339
Synonyms:
CHEMBL4452233
Type:
Small organic molecule
Emp. Form.:
C20H17F2N5O2
Mol. Mass.:
397.3781
SMILES:
Fc1cc(F)c2NC(=O)[C@H](CCc2c1)NC(=O)c1n[nH]c(Cc2ccccc2)n1
: