Target
Type-1 angiotensin II receptor B
Ligand
BDBM50047942
Substrate
Meas. Tech.
ChEBML_34804
IC50
210±n/a nM
Citation
 Sircar, IWinters, RTQuin, JLu, GHMajor, TCPanek, RL Nonpeptide angiotensin II receptor antagonists. 1. Synthesis and in vitro structure-activity relationships of 4-[[[(1H-pyrrol-1-ylacetyl)amino]phenyl]methyl]imidazole derivatives as angiotensin II receptor antagonists. J Med Chem 36:1735-45 (1993)  
Target
Name:
Type-1 angiotensin II receptor B
Synonyms:
AGTRB_RAT Agtr1 Angiotensin II AT1B Angiotensin II type 1b (AT-1b) receptor Type-1B angiotensin II receptor
Type:
Enzyme Catalytic Domain
Mol. Mass.:
40929.44
Organism:
RAT
Description:
Angiotensin II AT1B 0 RAT::P29089
Residue:
359
  
Inhibitor
Name:
BDBM50047942
Synonyms:
1-{1-[4-(2-Butyl-4-chloro-5-hydroxymethyl-imidazol-1-ylmethyl)-phenylcarbamoyl]-2-phenyl-ethyl}-1H-pyrrole-2-carboxylic acid methyl ester | CHEMBL49306
Type:
Small organic molecule
Emp. Form.:
C30H33ClN4O4
Mol. Mass.:
549.06
SMILES:
CCCCc1nc(Cl)c(CO)n1Cc1ccc(NC(=O)[C@H](Cc2ccccc2)n2cccc2C(=O)OC)cc1
: