Target
Type-1 angiotensin II receptor B
Ligand
BDBM50015270
Substrate
Meas. Tech.
ChEBML_34804
IC50
140±n/a nM
Citation
 Sircar, IWinters, RTQuin, JLu, GHMajor, TCPanek, RL Nonpeptide angiotensin II receptor antagonists. 1. Synthesis and in vitro structure-activity relationships of 4-[[[(1H-pyrrol-1-ylacetyl)amino]phenyl]methyl]imidazole derivatives as angiotensin II receptor antagonists. J Med Chem 36:1735-45 (1993)  
Target
Name:
Type-1 angiotensin II receptor B
Synonyms:
AGTRB_RAT Agtr1 Angiotensin II AT1B Angiotensin II type 1b (AT-1b) receptor Type-1B angiotensin II receptor
Type:
Enzyme Catalytic Domain
Mol. Mass.:
40929.44
Organism:
RAT
Description:
Angiotensin II AT1B 0 RAT::P29089
Residue:
359
  
Inhibitor
Name:
BDBM50015270
Synonyms:
CHEMBL262958 | N-[4-(2-Butyl-4-chloro-5-methoxycarbonylmethyl-imidazol-1-ylmethyl)-phenyl]-phthalamic acid
Type:
Small organic molecule
Emp. Form.:
C25H26ClN3O5
Mol. Mass.:
483.944
SMILES:
CCCCc1nc(Cl)c(CC(=O)OC)n1Cc1ccc(NC(=O)c2ccccc2C(O)=O)cc1
: