Target
Prostaglandin G/H synthase 2
Ligand
BDBM50048192
Substrate
Meas. Tech.
ChEMBL_159598 (CHEMBL760080)
IC50
>10000±n/a nM
Citation
 Li, CSBlack, WCChan, CCFord-Hutchinson, AWGauthier, JYGordon, RGuay, DKargman, SLau, CKMancini, J Cyclooxygenase-2 inhibitors. Synthesis and pharmacological activities of 5-methanesulfonamido-1-indanone derivatives. J Med Chem 38:4897-905 (1996)  
Target
Name:
Prostaglandin G/H synthase 2
Synonyms:
COX2 Cyclooxygenase 2 (COX-2) Cyclooxygenase-2 (COX-2 AA) Cyclooxygenase-2 (COX-2) PGH2_HUMAN PHS II Prostaglandin E synthase/G/H synthase 2 Prostaglandin-endoperoxide synthase 2
Type:
Enzyme
Mol. Mass.:
69003.89
Organism:
Homo sapiens (Human)
Description:
Recombinant Cox-2 provided by Cayman (Cayman Chemical Co.,Ann Arbor, MI).
Residue:
604
  
Inhibitor
Name:
BDBM50048192
Synonyms:
CHEMBL343198 | N-[6-(3-Fluoro-phenylsulfanyl)-1-oxo-indan-5-yl]-methanesulfonamide
Type:
Small organic molecule
Emp. Form.:
C16H14FNO3S2
Mol. Mass.:
351.416
SMILES:
CS(=O)(=O)Nc1cc2CCC(=O)c2cc1Sc1cccc(F)c1
: