Target
Retinoic acid receptor gamma
Ligand
BDBM50048298
Substrate
Meas. Tech.
ChEMBL_196012 (CHEMBL798022)
Ki
860±n/a nM
Citation
 Charpentier, BBernardon, JMEustache, JMillois, CMartin, BMichel, SShroot, B Synthesis, structure-affinity relationships, and biological activities of ligands binding to retinoic acid receptor subtypes. J Med Chem 38:4993-5006 (1996)  
Target
Name:
Retinoic acid receptor gamma
Synonyms:
NR1B3 RAR-gamma RARG_HUMAN Retinoic acid receptor gamma | Retinoid receptor
Type:
PROTEIN
Mol. Mass.:
50345.43
Organism:
Homo sapiens (Human)
Description:
ChEMBL_1458016
Residue:
454
  
Inhibitor
Name:
BDBM50048298
Synonyms:
6-(4,4-Dimethyl-chroman-6-yl)-naphthalene-2-carboxylic acid | CHEMBL342051
Type:
Small organic molecule
Emp. Form.:
C22H20O3
Mol. Mass.:
332.3924
SMILES:
CC1(C)CCOc2ccc(cc12)-c1ccc2cc(ccc2c1)C(O)=O
: