Target
5-hydroxytryptamine receptor 4
Ligand
BDBM50499468
Substrate
Meas. Tech.
ChEMBL_1541149 (CHEMBL3744758)
EC50
1.3±n/a nM
Citation
 Nirogi, RMohammed, ARShinde, AKBogaraju, NGagginapalli, SRRavella, SRKota, LBhyrapuneni, GMuddana, NRBenade, VPalacharla, RCJayarajan, PSubramanian, RGoyal, VK Synthesis and SAR of Imidazo[1,5-a]pyridine derivatives as 5-HT4 receptor partial agonists for the treatment of cognitive disorders associated with Alzheimer's disease. Eur J Med Chem 103:289-301 (2015)  
Target
Name:
5-hydroxytryptamine receptor 4
Synonyms:
5-HT-4 5-HT4S 5-HT4b 5-HT4d 5-hydroxytryptamine receptor 4 5HT4R_HUMAN Serotonin (5-HT) receptor Serotonin 4 (5-HT4) receptor | Serotonin Receptor 4
Type:
Enzyme
Mol. Mass.:
43767.54
Organism:
Homo sapiens (Human)
Description:
Q13639
Residue:
388
  
Inhibitor
Name:
BDBM50499468
Synonyms:
CHEMBL3741376
Type:
Small organic molecule
Emp. Form.:
C23H34N4O4
Mol. Mass.:
430.5405
SMILES:
CC(C)n1c2ccccc2n(C(=O)NCC2CCN(CC3(O)CCOCC3)CC2)c1=O
: