Target
Tumor necrosis factor
Ligand
BDBM50048933
Substrate
Meas. Tech.
ChEMBL_212395 (CHEMBL873375)
IC50
6000±n/a nM
Citation
 Cottam, HBShih, HTehrani, LRWasson, DBCarson, DA Substituted xanthines, pteridinediones, and related compounds as potential antiinflammatory agents. Synthesis and biological evaluation of inhibitors of tumor necrosis factor alpha. J Med Chem 39:2-9 (1996)  
Target
Name:
Tumor necrosis factor
Synonyms:
Cachectin TNF-a TNFA TNFSF2 Tumor necrosis factor (TNFa) Tumor necrosis factor ligand superfamily member 2 Tumor necrosis factor, soluble form | tumor necrosis factor alpha
Type:
Enzyme
Mol. Mass.:
25645.11
Organism:
Homo sapiens (Human)
Description:
P01375
Residue:
233
  
Inhibitor
Name:
BDBM50048933
Synonyms:
4-(3,7-Dimethyl-2,6-dioxo-2,3,6,7-tetrahydro-purin-1-yl)-butyric acid ethyl ester | CHEMBL170479
Type:
Small organic molecule
Emp. Form.:
C13H18N4O4
Mol. Mass.:
294.3064
SMILES:
CCOC(=O)CCCn1c(=O)n(C)c2ncn(C)c2c1=O
: