Target
Protein kinase C alpha type
Ligand
BDBM50048889
Substrate
Meas. Tech.
ChEMBL_160133 (CHEMBL766778)
Ki
138±n/a nM
Citation
 Lee, JWang, SMilne, GWSharma, RLewin, NEBlumberg, PMMarquez, VE Conformationally constrained analogues of diacylglycerol. 11. Ultrapotent protein kinase C ligands based on a chiral 5-disubstituted tetrahydro-2-furanone template. J Med Chem 39:29-35 (1996)  
Target
Name:
Protein kinase C alpha type
Synonyms:
KPCA_HUMAN PKC alpha and beta-2 PKC-alpha PRKACA Protein Kinase C- alpha Protein kinase C alpha (PKCa) Protein kinase C alpha type (PRKCA) RAF proto-oncogene serine/threonine-protein kinase
Type:
Enzyme
Mol. Mass.:
76755.65
Organism:
Homo sapiens (Human)
Description:
The recombinant human PKC enzymes were produced using a baculovirus expression system in SF9 cells
Residue:
672
  
Inhibitor
Name:
BDBM50048889
Synonyms:
CHEMBL299225 | Tetradecanoic acid 2-hydroxymethyl-5-oxo-tetrahydro-furan-2-ylmethyl ester
Type:
Small organic molecule
Emp. Form.:
C20H36O5
Mol. Mass.:
356.4968
SMILES:
CCCCCCCCCCCCCC(=O)OCC1(CO)CCC(=O)O1
: