Target
Receptor-type tyrosine-protein phosphatase S
Ligand
BDBM23411
Substrate
Meas. Tech.
ChEMBL_1540643 (CHEMBL3744704)
IC50
600±n/a nM
Citation
 Lee, HSKu, BPark, THPark, HChoi, JKChang, KTKim, CHRyu, SEKim, SJ Identification of novel protein tyrosine phosphatase sigma inhibitors promoting neurite extension. Bioorg Med Chem Lett 26:87-93 (2016)  
Target
Name:
Receptor-type tyrosine-protein phosphatase S
Synonyms:
PTPRS R-PTP-S Receptor-type tyrosine-protein phosphatase S | Receptor-type tyrosine-protein phosphatase sigma
Type:
PROTEIN
Mol. Mass.:
217036.26
Organism:
Homo sapiens (Human)
Description:
ChEMBL_107614
Residue:
1948
  
Inhibitor
Name:
BDBM23411
Synonyms:
5,6,7-trihydroxy-2-(4-hydroxyphenyl)-4H-chromen-4-one Scutellarein Scutellarein (28) | US10252984, Table 2.2
Type:
flavone
Emp. Form.:
C15H10O6
Mol. Mass.:
286.2363
SMILES:
Oc1ccc(cc1)-c1cc(=O)c2c(O)c(O)c(O)cc2o1
: