Target
CAAX prenyl protease 2
Ligand
BDBM50500098
Substrate
Meas. Tech.
ChEMBL_1541784 (CHEMBL3742598)
IC50
5300±n/a nM
Citation
 Mohammed, IHampton, SEAshall, LHildebrandt, ERKutlik, RAManandhar, SPFloyd, BJSmith, HEDozier, JKDistefano, MDSchmidt, WKDore, TM 8-Hydroxyquinoline-based inhibitors of the Rce1 protease disrupt Ras membrane localization in human cells. Bioorg Med Chem 24:160-78 (2016)  
Target
Name:
CAAX prenyl protease 2
Synonyms:
CAAX prenyl protease 2 FACE2 Farnesylated proteins-converting enzyme 2 Prenyl protein-specific endoprotease 2 RCE1 homolog RCE1B | hRCE1
Type:
PROTEIN
Mol. Mass.:
35839.94
Organism:
Homo sapiens (Human)
Description:
ChEMBL_194935
Residue:
329
  
Inhibitor
Name:
BDBM50500098
Synonyms:
CHEMBL3741101
Type:
Small organic molecule
Emp. Form.:
C24H19NO3
Mol. Mass.:
369.4126
SMILES:
OC(=O)c1cccc(NC(c2ccccc2)c2ccc3ccccc3c2O)c1
: