Target
Retinoic acid receptor gamma
Ligand
BDBM50051552
Substrate
Meas. Tech.
ChEMBL_196002 (CHEMBL797866)
Kd
3.3±n/a nM
Citation
 Yu, KLSpinazze, POstrowski, JCurrier, SJPack, EJHammer, LRoalsvig, THoneyman, JATortolani, DRReczek, PRMansuri, MMStarrett, JE Retinoic acid receptor beta,gamma-selective ligands: synthesis and biological activity of 6-substituted 2-naphthoic acid retinoids. J Med Chem 39:2411-21 (1996)  
Target
Name:
Retinoic acid receptor gamma
Synonyms:
NR1B3 RAR-gamma RARG_HUMAN Retinoic acid receptor gamma | Retinoid receptor
Type:
PROTEIN
Mol. Mass.:
50345.43
Organism:
Homo sapiens (Human)
Description:
ChEMBL_1458016
Residue:
454
  
Inhibitor
Name:
BDBM50051552
Synonyms:
6-[HYDROXYIMINO-(5,5,8,8-TETRAMETHYL-5,6,7,8-TETRAHYDRO-NAPHTALEN-2-YL)-METHYL]-NAPHTALENE-2-CARBOXYLIC ACID 6-[[(E)-hydroxyimino]-(5,5,8,8-tetramethyl-5,6,7,8-tetrahydro-naphthalen-2-yl)-methyl]-naphthalene-2-carboxylic acid | CHEMBL77961
Type:
Small organic molecule
Emp. Form.:
C26H27NO3
Mol. Mass.:
401.4975
SMILES:
CC1(C)CCC(C)(C)c2cc(ccc12)C(N=O)c1ccc2cc(ccc2c1)C(O)=O
: