Target
B-cell CLL/lymphoma 9 protein
Ligand
BDBM50501081
Substrate
Meas. Tech.
ChEMBL_1586628 (CHEMBL3821983)
Ki
16000±n/a nM
Citation
 Wisniewski, JAYin, JTeuscher, KBZhang, MJi, H Structure-Based Design of 1,4-Dibenzoylpiperazines as ?-Catenin/B-Cell Lymphoma 9 Protein-Protein Interaction Inhibitors. ACS Med Chem Lett 7:508-13 (2016)  
Target
Name:
B-cell CLL/lymphoma 9 protein
Synonyms:
B-cell CLL/lymphoma 9 protein BCL9 Bcl-9 | Protein legless homolog
Type:
PROTEIN
Mol. Mass.:
149313.19
Organism:
Homo sapiens
Description:
ChEMBL_117069
Residue:
1426
  
Inhibitor
Name:
BDBM50501081
Synonyms:
CHEMBL3819020
Type:
Small organic molecule
Emp. Form.:
C33H43Cl2F4N5O3
Mol. Mass.:
704.626
SMILES:
Cl.Cl.Fc1cc(cc(c1)C(=O)N1CCN(CC1)C(=O)c1ccc(O[C@H]2CCNC2)c(c1)C1CCC(CC1)C(F)(F)F)N1CCNCC1
: