Target
Xanthine dehydrogenase/oxidase
Ligand
BDBM50051712
Substrate
Meas. Tech.
ChEMBL_217080 (CHEMBL823476)
Ki
2070±n/a nM
Citation
 Biagi, GCostantini, ACostantino, LGiorgi, ILivi, OPecorari, PRinaldi, MScartoni, V Synthesis and biological evaluation of new imidazole, pyrimidine, and purine derivatives and analogs as inhibitors of xanthine oxidase. J Med Chem 39:2529-35 (1996)  
Target
Name:
Xanthine dehydrogenase/oxidase
Synonyms:
XD XDHA XO Xanthine dehydrogenase/oxidase | Xanthine oxidase
Type:
Enzyme
Mol. Mass.:
146441.21
Organism:
Homo sapiens (Human)
Description:
P47989
Residue:
1333
  
Inhibitor
Name:
BDBM50051712
Synonyms:
2-Mercapto-8-phenyl-1,9-dihydro-purin-6-one | CHEMBL315561
Type:
Small organic molecule
Emp. Form.:
C11H8N4OS
Mol. Mass.:
244.272
SMILES:
O=c1[nH]c(=S)[nH]c2nc([nH]c12)-c1ccccc1
: