Target
Xanthine dehydrogenase/oxidase
Ligand
BDBM50051740
Substrate
Meas. Tech.
ChEMBL_217080 (CHEMBL823476)
Ki
1860±n/a nM
Citation
 Biagi, GCostantini, ACostantino, LGiorgi, ILivi, OPecorari, PRinaldi, MScartoni, V Synthesis and biological evaluation of new imidazole, pyrimidine, and purine derivatives and analogs as inhibitors of xanthine oxidase. J Med Chem 39:2529-35 (1996)  
Target
Name:
Xanthine dehydrogenase/oxidase
Synonyms:
XD XDHA XO Xanthine dehydrogenase/oxidase | Xanthine oxidase
Type:
Enzyme
Mol. Mass.:
146441.21
Organism:
Homo sapiens (Human)
Description:
P47989
Residue:
1333
  
Inhibitor
Name:
BDBM50051740
Synonyms:
2-Mercapto-7,8-dihydro-3H-thiazolo[2,3-i]purin-5-one | CHEMBL85381
Type:
Small organic molecule
Emp. Form.:
C7H6N4OS2
Mol. Mass.:
226.279
SMILES:
O=c1nc2[nH]c(=S)[nH]c2c2SCCn12
: