Target
Xanthine dehydrogenase/oxidase
Ligand
BDBM50051738
Substrate
Meas. Tech.
ChEMBL_217080 (CHEMBL823476)
Ki
2560±n/a nM
Citation
 Biagi, GCostantini, ACostantino, LGiorgi, ILivi, OPecorari, PRinaldi, MScartoni, V Synthesis and biological evaluation of new imidazole, pyrimidine, and purine derivatives and analogs as inhibitors of xanthine oxidase. J Med Chem 39:2529-35 (1996)  
Target
Name:
Xanthine dehydrogenase/oxidase
Synonyms:
XD XDHA XO Xanthine dehydrogenase/oxidase | Xanthine oxidase
Type:
Enzyme
Mol. Mass.:
146441.21
Organism:
Homo sapiens (Human)
Description:
P47989
Residue:
1333
  
Inhibitor
Name:
BDBM50051738
Synonyms:
5-Hexanoylamino-1H-imidazole-4-carboxylic acid amide | CHEMBL86311
Type:
Small organic molecule
Emp. Form.:
C10H16N4O2
Mol. Mass.:
224.2596
SMILES:
CCCCCC(=O)Nc1nc[nH]c1C(N)=O
: