Target
Xanthine dehydrogenase/oxidase
Ligand
BDBM50051743
Substrate
Meas. Tech.
ChEMBL_217080 (CHEMBL823476)
Ki
25700±n/a nM
Citation
 Biagi, GCostantini, ACostantino, LGiorgi, ILivi, OPecorari, PRinaldi, MScartoni, V Synthesis and biological evaluation of new imidazole, pyrimidine, and purine derivatives and analogs as inhibitors of xanthine oxidase. J Med Chem 39:2529-35 (1996)  
Target
Name:
Xanthine dehydrogenase/oxidase
Synonyms:
XD XDHA XO Xanthine dehydrogenase/oxidase | Xanthine oxidase
Type:
Enzyme
Mol. Mass.:
146441.21
Organism:
Homo sapiens (Human)
Description:
P47989
Residue:
1333
  
Inhibitor
Name:
BDBM50051743
Synonyms:
2-Pentylamino-1,9-dihydro-purin-6-one | CHEMBL84310
Type:
Small organic molecule
Emp. Form.:
C10H15N5O
Mol. Mass.:
221.259
SMILES:
CCCCCNc1nc2nc[nH]c2c(=O)[nH]1
: