Target
Cyclin-H/Cyclin-dependent kinase 7
Ligand
BDBM50501611
Substrate
Meas. Tech.
ChEMBL_1656377 (CHEMBL4005847)
Ki
780±n/a nM
Citation
 Tadesse, SYu, MMekonnen, LBLam, FIslam, STomusange, KRahaman, MHNoll, BBasnet, SKTeo, TAlbrecht, HMilne, RWang, S Highly Potent, Selective, and Orally Bioavailable 4-Thiazol-N-(pyridin-2-yl)pyrimidin-2-amine Cyclin-Dependent Kinases 4 and 6 Inhibitors as Anticancer Drug Candidates: Design, Synthesis, and Evaluation. J Med Chem 60:1892-1915 (2017)  
Target
Name:
Cyclin-H/Cyclin-dependent kinase 7
Synonyms:
CDK-activating kinase assembly factor MAT1/Cyclin H/Cyclin-dependent kinase 7 CDK7/H Cyclin-Dependent Kinase 7 (CDK7) Cyclin-dependent kinase 7/cyclin H
Type:
Protein Complex
Mol. Mass.:
Description:
Components:
This complex has 2 components.
Component 1
Name:
Cyclin-H
Synonyms:
CCNH Cyclin H p34 | p37
Type:
Enzyme Subunit
Mol. Mass.:
37646.05
Organism:
Homo sapiens (Human)
Description:
Residue:
323
  
Component 2
Name:
Cyclin-dependent kinase 7
Synonyms:
39 kDa protein kinase CAK1 CDK-activating kinase 1 (CAK) CDK7_HUMAN Cell division protein kinase 7 Cyclin-dependent kinase 7 (CDK7/cyclin H) P39 Mo15 TFIIH basal transcription factor complex kinase subunit
Type:
Enzyme Subunit
Mol. Mass.:
39047.01
Organism:
Homo sapiens (Human)
Description:
Residue:
346
  
Inhibitor
Name:
BDBM50501611
Synonyms:
CHEMBL4070914
Type:
Small organic molecule
Emp. Form.:
C24H32N8S
Mol. Mass.:
464.629
SMILES:
CCN1CCN(CC1)c1ccc(Nc2nccc(n2)-c2sc(NC3CCCC3)nc2C)nc1
: