Target
D(3) dopamine receptor
Ligand
BDBM50052194
Substrate
Meas. Tech.
ChEMBL_62756 (CHEMBL674596)
Ki
1.9±n/a nM
Citation
 Ohmori, JMaeno, KHidaka, KNakato, KMatsumoto, MTada, SHattori, HSakamoto, STsukamoto, SUsuda, SMase, T Dopamine D3 and D4 receptor antagonists: synthesis and structure--activity relationships of (S)-(+)-N-(1-Benzyl-3-pyrrolidinyl)-5-chloro-4- [(cyclopropylcarbonyl) amino]-2-methoxybenzamide (YM-43611) and related compounds. J Med Chem 39:2764-72 (1996)  
Target
Name:
D(3) dopamine receptor
Synonyms:
DOPAMINE D3 Dopamine D3 receptor | Drd3
Type:
Protein
Mol. Mass.:
49540.58
Organism:
Rattus norvegicus (Rat)
Description:
P19020
Residue:
446
  
Inhibitor
Name:
BDBM50052194
Synonyms:
4-Amino-N-((R)-1-benzyl-pyrrolidin-3-yl)-5-chloro-2-methoxy-benzamide | CHEMBL327984
Type:
Small organic molecule
Emp. Form.:
C19H22ClN3O2
Mol. Mass.:
359.85
SMILES:
COc1cc(N)c(Cl)cc1C(=O)N[C@@H]1CCN(Cc2ccccc2)C1
: