Target
5-hydroxytryptamine receptor 1A
Ligand
BDBM50005127
Substrate
Meas. Tech.
ChEMBL_1808978 (CHEMBL4308337)
Ki
3.4±n/a nM
Citation
 Ku?aga, DJa?kowska, JSata?a, G Design, synthesis and biological evaluation of novel serotonin and dopamine receptor ligands being 6-bromohexyl saccharine derivatives. Bioorg Med Chem Lett 29:0 (2019)  
Target
Name:
5-hydroxytryptamine receptor 1A
Synonyms:
5-HT-1A 5-HT1A 5-hydroxytryptamine receptor 1A (5HT1A) 5ht1a Htr1a Serotonin 1a (5-HT1a) receptor/Adrenergic receptor alpha-1 | Serotonin receptor 1A
Type:
G Protein-Coupled Receptor (GPCR)
Mol. Mass.:
46445.29
Organism:
Rattus norvegicus (rat)
Description:
Binding assays were performed using rat hippocampal membranes.
Residue:
422
  
Inhibitor
Name:
BDBM50005127
Synonyms:
1,1-Dioxo-2-[4-(4-pyrimidin-2-yl-piperazin-1-yl)-butyl]-1,2-dihydro-1lambda*6*-benzo[d]isothiazol-3-one 1,1-Dioxo-2-[4-(4-pyrimidin-2-yl-piperazin-1-yl)-butyl]-1,2-dihydro-1lambda*6*-benzo[d]isothiazol-3-one(Ipsapirone) IPSAPIRONE
Type:
Small organic molecule
Emp. Form.:
C19H23N5O3S
Mol. Mass.:
401.483
SMILES:
O=C1N(CCCCN2CCN(CC2)c2ncccn2)S(=O)(=O)c2ccccc12
: