Target
Glycogen synthase kinase-3 beta
Ligand
BDBM50503007
Substrate
Meas. Tech.
ChEMBL_1809171 (CHEMBL4308530)
IC50
739±n/a nM
Citation
 Heider, FPantsar, TKudolo, MAnsideri, FDe Simone, APruccoli, LSchneider, TGoettert, MITarozzi, AAndrisano, VLaufer, SAKoch, P Pyridinylimidazoles as GSK3? Inhibitors: The Impact of Tautomerism on Compound Activity via Water Networks. ACS Med Chem Lett 10:1407-1414 (2019)  
Target
Name:
Glycogen synthase kinase-3 beta
Synonyms:
GSK-3 beta GSK3B Glycogen synthase kinase 3 beta (GSK3B) Glycogen synthase kinase-3 beta (GSK-3B) Glycogen synthase kinase-3 beta (GSK3B) Glycogen synthase kinase-3beta (GSK3B) | Serine/threonine-protein kinase GSK3B
Type:
Enzyme
Mol. Mass.:
46756.38
Organism:
Homo sapiens (Human)
Description:
P49841
Residue:
420
  
Inhibitor
Name:
BDBM50503007
Synonyms:
CHEMBL4446123
Type:
Small organic molecule
Emp. Form.:
C15H16N4O3
Mol. Mass.:
300.3125
SMILES:
CCOC(=O)c1ncc([nH]1)-c1ccnc(NC(=O)C2CC2)c1
: