Target
Glycogen synthase kinase-3 beta
Ligand
BDBM50502993
Substrate
Meas. Tech.
ChEMBL_1809171 (CHEMBL4308530)
IC50
354±n/a nM
Citation
 Heider, FPantsar, TKudolo, MAnsideri, FDe Simone, APruccoli, LSchneider, TGoettert, MITarozzi, AAndrisano, VLaufer, SAKoch, P Pyridinylimidazoles as GSK3? Inhibitors: The Impact of Tautomerism on Compound Activity via Water Networks. ACS Med Chem Lett 10:1407-1414 (2019)  
Target
Name:
Glycogen synthase kinase-3 beta
Synonyms:
GSK-3 beta GSK3B Glycogen synthase kinase 3 beta (GSK3B) Glycogen synthase kinase-3 beta (GSK-3B) Glycogen synthase kinase-3 beta (GSK3B) Glycogen synthase kinase-3beta (GSK3B) | Serine/threonine-protein kinase GSK3B
Type:
Enzyme
Mol. Mass.:
46756.38
Organism:
Homo sapiens (Human)
Description:
P49841
Residue:
420
  
Inhibitor
Name:
BDBM50502993
Synonyms:
CHEMBL4439815
Type:
Small organic molecule
Emp. Form.:
C13H12BrN5O2
Mol. Mass.:
350.171
SMILES:
NC(=O)c1ncc([nH]1)-c1cc(NC(=O)C2CC2)ncc1Br
: