Target
Mitogen-activated protein kinase 14
Ligand
BDBM50503019
Substrate
Meas. Tech.
ChEMBL_1809172 (CHEMBL4308531)
IC50
117±n/a nM
Citation
 Heider, FPantsar, TKudolo, MAnsideri, FDe Simone, APruccoli, LSchneider, TGoettert, MITarozzi, AAndrisano, VLaufer, SAKoch, P Pyridinylimidazoles as GSK3? Inhibitors: The Impact of Tautomerism on Compound Activity via Water Networks. ACS Med Chem Lett 10:1407-1414 (2019)  
Target
Name:
Mitogen-activated protein kinase 14
Synonyms:
CSAID-binding protein CSBP1 CSPB1 MAP kinase 14 MAP kinase p38 alpha MAPK14 MK14_HUMAN Mitogen-activated protein kinase p38 alpha Stress-activated protein kinase 2a | p38 MAP kinase alpha/beta
Type:
Serine/threonine-protein kinase
Mol. Mass.:
41286.76
Organism:
Homo sapiens (Human)
Description:
Q16539
Residue:
360
  
Inhibitor
Name:
BDBM50503019
Synonyms:
CHEMBL4564217
Type:
Small organic molecule
Emp. Form.:
C17H14FN5O2
Mol. Mass.:
339.3238
SMILES:
CC(=O)Nc1cc(ccn1)-c1[nH]c(nc1-c1ccc(F)cc1)C(N)=O
: