Target
Mitogen-activated protein kinase 14
Ligand
BDBM50503011
Substrate
Meas. Tech.
ChEMBL_1809172 (CHEMBL4308531)
IC50
16±n/a nM
Citation
 Heider, FPantsar, TKudolo, MAnsideri, FDe Simone, APruccoli, LSchneider, TGoettert, MITarozzi, AAndrisano, VLaufer, SAKoch, P Pyridinylimidazoles as GSK3? Inhibitors: The Impact of Tautomerism on Compound Activity via Water Networks. ACS Med Chem Lett 10:1407-1414 (2019)  
Target
Name:
Mitogen-activated protein kinase 14
Synonyms:
CSAID-binding protein CSBP1 CSPB1 MAP kinase 14 MAP kinase p38 alpha MAPK14 MK14_HUMAN Mitogen-activated protein kinase p38 alpha Stress-activated protein kinase 2a | p38 MAP kinase alpha/beta
Type:
Serine/threonine-protein kinase
Mol. Mass.:
41286.76
Organism:
Homo sapiens (Human)
Description:
Q16539
Residue:
360
  
Inhibitor
Name:
BDBM50503011
Synonyms:
CHEMBL4461695
Type:
Small organic molecule
Emp. Form.:
C20H15F4N5O2
Mol. Mass.:
433.359
SMILES:
NC(=O)c1nc(c([nH]1)-c1ccnc(NC(=O)C2CC2)c1)-c1ccc(F)c(c1)C(F)(F)F
: