Target
Mitogen-activated protein kinase 14
Ligand
BDBM50503023
Substrate
Meas. Tech.
ChEMBL_1809172 (CHEMBL4308531)
IC50
48±n/a nM
Citation
 Heider, FPantsar, TKudolo, MAnsideri, FDe Simone, APruccoli, LSchneider, TGoettert, MITarozzi, AAndrisano, VLaufer, SAKoch, P Pyridinylimidazoles as GSK3? Inhibitors: The Impact of Tautomerism on Compound Activity via Water Networks. ACS Med Chem Lett 10:1407-1414 (2019)  
Target
Name:
Mitogen-activated protein kinase 14
Synonyms:
CSAID-binding protein CSBP1 CSPB1 MAP kinase 14 MAP kinase p38 alpha MAPK14 MK14_HUMAN Mitogen-activated protein kinase p38 alpha Stress-activated protein kinase 2a | p38 MAP kinase alpha/beta
Type:
Serine/threonine-protein kinase
Mol. Mass.:
41286.76
Organism:
Homo sapiens (Human)
Description:
Q16539
Residue:
360
  
Inhibitor
Name:
BDBM50503023
Synonyms:
CHEMBL4576003
Type:
Small organic molecule
Emp. Form.:
C17H16N4OS
Mol. Mass.:
324.4
SMILES:
Cc1nc(-c2cccs2)c([nH]1)-c1ccnc(NC(=O)C2CC2)c1
: