Target
Glutamate receptor ionotropic, kainate 2
Ligand
BDBM50053077
Substrate
Meas. Tech.
ChEMBL_90595 (CHEMBL701552)
Ki
16±n/a nM
Citation
 Cantrell, BEZimmerman, DMMonn, JAKamboj, RKHoo, KHTizzano, JPPullar, IAFarrell, LNBleakman, D Synthesis of a series of aryl kainic acid analogs and evaluation in cells stably expressing the kainate receptor humGluR6. J Med Chem 39:3617-24 (1996)  
Target
Name:
Glutamate receptor ionotropic, kainate 2
Synonyms:
GRIK2_RAT Glutamate receptor ionotropic kainate 2 Ionotropic glutamate receptor kainate 2/5
Type:
PROTEIN
Mol. Mass.:
102478.61
Organism:
Rattus norvegicus
Description:
ChEMBL_936439
Residue:
908
  
Inhibitor
Name:
BDBM50053077
Synonyms:
(2S,3S,4S)-3-Carboxymethyl-4-[1-(3-phenethyloxy-phenyl)-vinyl]-pyrrolidine-2-carboxylic acid | CHEMBL334024
Type:
Small organic molecule
Emp. Form.:
C23H25NO5
Mol. Mass.:
395.4483
SMILES:
OC(=O)C[C@H]1[C@H](CN[C@@H]1C(O)=O)C(=C)c1cccc(OCCc2ccccc2)c1
: