Target
Polyunsaturated fatty acid 5-lipoxygenase
Ligand
BDBM50053464
Substrate
Meas. Tech.
ChEMBL_3920 (CHEMBL619923)
IC50
4600±n/a nM
Citation
 Bhatia, PABrooks, CDBasha, ARatajczyk, JDGunn, BPBouska, JBLanni, CYoung, PRBell, RLCarter, GW 5-Lipoxygenase inhibitors: synthesis and structure-activity relationships of a series of 1-aryl-2H,4H-tetrahydro-1,2,4-triazin-3-ones. J Med Chem 39:3938-50 (1996)  
Target
Name:
Polyunsaturated fatty acid 5-lipoxygenase
Synonyms:
Alox5 LOX5_RAT
Type:
PROTEIN
Mol. Mass.:
78082.31
Organism:
Rattus norvegicus
Description:
ChEMBL_1432947
Residue:
673
  
Inhibitor
Name:
BDBM50053464
Synonyms:
1-Phenyl-[1,2,4]triazinan-3-one CHEMBL340341
Type:
Small organic molecule
Emp. Form.:
C9H11N3O
Mol. Mass.:
177.2031
SMILES:
O=C1NCCN(N1)c1ccccc1
: