Target
Polyunsaturated fatty acid 5-lipoxygenase
Ligand
BDBM50053464
Substrate
Meas. Tech.
ChEMBL_3804 (CHEMBL619879)
IC50
5800±n/a nM
Citation
 Bhatia, PABrooks, CDBasha, ARatajczyk, JDGunn, BPBouska, JBLanni, CYoung, PRBell, RLCarter, GW 5-Lipoxygenase inhibitors: synthesis and structure-activity relationships of a series of 1-aryl-2H,4H-tetrahydro-1,2,4-triazin-3-ones. J Med Chem 39:3938-50 (1996)  
Target
Name:
Polyunsaturated fatty acid 5-lipoxygenase
Synonyms:
5-LO 5-Lipoxygenase (5-LO) 5-Lipoygenase ALOX5 LOG5 | LOX5_HUMAN
Type:
Enzyme
Mol. Mass.:
77972.74
Organism:
Homo sapiens (Human)
Description:
Recombinant protein was purified from E. coli lysate. After ammonium sulfate precipitation and subsequent steps, the supernatant (S100) was used for 5-LO activity assay.
Residue:
674
  
Inhibitor
Name:
BDBM50053464
Synonyms:
1-Phenyl-[1,2,4]triazinan-3-one CHEMBL340341
Type:
Small organic molecule
Emp. Form.:
C9H11N3O
Mol. Mass.:
177.2031
SMILES:
O=C1NCCN(N1)c1ccccc1
: