Target
Muscarinic acetylcholine receptor M5
Ligand
BDBM50023229
Substrate
Meas. Tech.
ChEMBL_1810469 (CHEMBL4309929)
EC50
190±n/a nM
Citation
 Wold, EAChen, JCunningham, KAZhou, J Allosteric Modulation of Class A GPCRs: Targets, Agents, and Emerging Concepts. J Med Chem 62:88-127 (2019)  
Target
Name:
Muscarinic acetylcholine receptor M5
Synonyms:
ACM5_HUMAN | CHRM5
Type:
PROTEIN
Mol. Mass.:
60102.35
Organism:
Homo sapiens (Human)
Description:
ChEMBL_1517990
Residue:
532
  
Inhibitor
Name:
BDBM50023229
Synonyms:
CHEMBL3329755
Type:
Small organic molecule
Emp. Form.:
C23H25F3N4O3S
Mol. Mass.:
494.53
SMILES:
CCN(Cc1ccccc1C(F)(F)F)C(=O)C1CCN(CC1)S(=O)(=O)c1ccc2[nH]ncc2c1
: