Target
Bromodomain-containing protein 3
Ligand
BDBM50443232
Substrate
Meas. Tech.
ChEMBL_1810625 (CHEMBL4310085)
Ki
100±n/a nM
Citation
 Divakaran, ATalluri, SKAyoub, AMMishra, NKCui, HWiden, JCBerndt, NZhu, JYCarlson, ASTopczewski, JJSchonbrunn, EKHarki, DAPomerantz, WCK Molecular Basis for the N-Terminal Bromodomain-and-Extra-Terminal-Family Selectivity of a Dual Kinase-Bromodomain Inhibitor. J Med Chem 61:9316-9334 (2018)  
Target
Name:
Bromodomain-containing protein 3
Synonyms:
BRD3 Bromodomain and extra-terminal motif (BET) Bromodomain-containing protein 3 (BRD3) RING3-like protein | RING3L
Type:
Protein
Mol. Mass.:
79571.81
Organism:
Homo sapiens (Human)
Description:
Q15059
Residue:
726
  
Inhibitor
Name:
BDBM50443232
Synonyms:
CHEMBL3086883
Type:
Small organic molecule
Emp. Form.:
C18H17N5O3S
Mol. Mass.:
383.424
SMILES:
Cc1cc(N=Nc2ccc(cc2)S(=O)(=O)Nc2ccccn2)c(N)cc1O
: