Target
Bromodomain-containing protein 4
Ligand
BDBM50443232
Substrate
Meas. Tech.
ChEMBL_1810619 (CHEMBL4310079)
Ki
340±n/a nM
Citation
 Divakaran, ATalluri, SKAyoub, AMMishra, NKCui, HWiden, JCBerndt, NZhu, JYCarlson, ASTopczewski, JJSchonbrunn, EKHarki, DAPomerantz, WCK Molecular Basis for the N-Terminal Bromodomain-and-Extra-Terminal-Family Selectivity of a Dual Kinase-Bromodomain Inhibitor. J Med Chem 61:9316-9334 (2018)  
Target
Name:
Bromodomain-containing protein 4
Synonyms:
BRD4 Bromodomain-containing protein 4 (BRD4) Protein HUNK1
Type:
Protein
Mol. Mass.:
152264.84
Organism:
Homo sapiens (Human)
Description:
O60885
Residue:
1362
  
Inhibitor
Name:
BDBM50443232
Synonyms:
CHEMBL3086883
Type:
Small organic molecule
Emp. Form.:
C18H17N5O3S
Mol. Mass.:
383.424
SMILES:
Cc1cc(N=Nc2ccc(cc2)S(=O)(=O)Nc2ccccn2)c(N)cc1O
: