Target
Lysine-specific histone demethylase 1A
Ligand
BDBM50503500
Substrate
Meas. Tech.
ChEMBL_1811033 (CHEMBL4310493)
IC50
5.0±n/a nM
Citation
 Nie, ZShi, LLai, CSeverin, CXu, JDel Rosario, JRStansfield, RKCho, RWKanouni, TVeal, JMStafford, JAChen, YK Structure-based design and discovery of potent and selective lysine-specific demethylase 1 (LSD1) inhibitors. Bioorg Med Chem Lett 29:103-106 (2019)  
Target
Name:
Lysine-specific histone demethylase 1A
Synonyms:
AOF2 Flavin-containing amine oxidase domain-containing protein 2 KDM1A KIAA0601 Lysine-specific demethylase 1 (LSD1) Lysine-specific histone demethylase 1 (LSD1)
Type:
Enzyme
Mol. Mass.:
92901.01
Organism:
Homo sapiens (Human)
Description:
O60341
Residue:
852
  
Inhibitor
Name:
BDBM50503500
Synonyms:
CHEMBL4451430 | US10626103, Example 62
Type:
Small organic molecule
Emp. Form.:
C24H23F2N5O2
Mol. Mass.:
451.4685
SMILES:
COc1ccc(cc1F)-n1c(C)c(nc1-c1ccc(C#N)c(F)c1)C(=O)N[C@@H]1CCCNC1
: