Target
Lysine-specific histone demethylase 1A
Ligand
BDBM50503504
Substrate
Meas. Tech.
ChEMBL_1811033 (CHEMBL4310493)
IC50
0.700000±n/a nM
Citation
 Nie, ZShi, LLai, CSeverin, CXu, JDel Rosario, JRStansfield, RKCho, RWKanouni, TVeal, JMStafford, JAChen, YK Structure-based design and discovery of potent and selective lysine-specific demethylase 1 (LSD1) inhibitors. Bioorg Med Chem Lett 29:103-106 (2019)  
Target
Name:
Lysine-specific histone demethylase 1A
Synonyms:
AOF2 Flavin-containing amine oxidase domain-containing protein 2 KDM1A KIAA0601 Lysine-specific demethylase 1 (LSD1) Lysine-specific histone demethylase 1 (LSD1)
Type:
Enzyme
Mol. Mass.:
92901.01
Organism:
Homo sapiens (Human)
Description:
O60341
Residue:
852
  
Inhibitor
Name:
BDBM50503504
Synonyms:
CHEMBL4444902 | US10626103, Example 54
Type:
Small organic molecule
Emp. Form.:
C25H23ClFN7O
Mol. Mass.:
491.948
SMILES:
CN[C@H]1CCN(C1)C(=O)c1nc(-c2ccc(C#N)c(F)c2)n(c1C)-c1ccc2nn(C)c(Cl)c2c1
: