Target
Prothrombin
Ligand
BDBM50054502
Substrate
Meas. Tech.
ChEMBL_208676 (CHEMBL813335)
Ki
1.01±n/a nM
Citation
 Semple, JERowley, DCBrunck, TKHa-Uong, TMinami, NKOwens, TDTamura, SYGoldman, EASiev, DVArdecky, RJCarpenter, SHGe, YRichard, BMNolan, TGHåkanson, KTulinsky, ANutt, RFRipka, WC Design, synthesis, and evolution of a novel, selective, and orally bioavailable class of thrombin inhibitors: P1-argininal derivatives incorporating P3-P4 lactam sulfonamide moieties. J Med Chem 39:4531-6 (1996)  
Target
Name:
Prothrombin
Synonyms:
Activation peptide fragment 1 Coagulation factor II Prothrombin precursor Thrombin heavy chain | Thrombin light chain
Type:
Protein
Mol. Mass.:
70029.57
Organism:
Homo sapiens (Human)
Description:
P00734
Residue:
622
  
Inhibitor
Name:
BDBM50054502
Synonyms:
CHEMBL140494 | N-((S)-3-Carbamimidoyl-2-hydroxy-cyclohexyl)-2-((S)-2-oxo-3-phenylmethanesulfonylamino-piperidin-1-yl)-acetamide
Type:
Small organic molecule
Emp. Form.:
C21H31N5O5S
Mol. Mass.:
465.566
SMILES:
NC(=N)C1CCC[C@H](NC(=O)CN2CCC[C@H](NS(=O)(=O)Cc3ccccc3)C2=O)C1O
: