Target
Carbonic anhydrase 2
Ligand
BDBM50503786
Substrate
Meas. Tech.
ChEMBL_1812146 (CHEMBL4311606)
Kd
0.028000±n/a nM
Citation
 Va?kevi?ien?, IPaketuryt?, VPajanok, N?ukauskas, ?Sapijanskait?, BKantminien?, KMickevi?ius, VZubrien?, AMatulis, D Pyrrolidinone-bearing methylated and halogenated benzenesulfonamides as inhibitors of carbonic anhydrases. Bioorg Med Chem 27:322-337 (2019)  
Target
Name:
Carbonic anhydrase 2
Synonyms:
CA-II CAC Carbonate dehydratase II Carbonic anhydrase 2 (CA-II) Carbonic anhydrase C Carbonic anhydrase II (CA-II) Carbonic anhydrase II (hCA II) | Carbonic anhydrase isoenzyme II (hCA II)
Type:
Enzyme
Mol. Mass.:
29250.71
Organism:
Homo sapiens (Human)
Description:
P00918
Residue:
260
  
Inhibitor
Name:
BDBM50503786
Synonyms:
CHEMBL4555622
Type:
Small organic molecule
Emp. Form.:
C20H20ClN5O6S
Mol. Mass.:
493.921
SMILES:
Cc1cc(N2CC(CC2=O)C(=O)N\N=C\c2ccc(cc2)[N+]([O-])=O)c(Cl)c(C)c1S(N)(=O)=O
: