Target
Lanosterol synthase
Ligand
BDBM50055642
Substrate
Meas. Tech.
ChEMBL_148898 (CHEMBL882413)
IC50
1000±n/a nM
Citation
 Stach, DZheng, YFPerez, ALOehlschlager, ACAbe, IPrestwich, GDHartman, PG Synthesis and inhibition studies of sulfur-substituted squalene oxide analogues as mechanism-based inhibitors of 2,3-oxidosqualene-lanosterol cyclase. J Med Chem 40:201-9 (1997)  
Target
Name:
Lanosterol synthase
Synonyms:
LSS_RAT Osc
Type:
PROTEIN
Mol. Mass.:
83302.12
Organism:
Rattus norvegicus
Description:
ChEMBL_12083
Residue:
733
  
Inhibitor
Name:
BDBM50055642
Synonyms:
2,2-Dimethyl-3-[(3E,7E,11E)-3,7,12-trimethyl-15-(4-methyl-pent-3-enylsulfanyl)-pentadeca-3,7,11-trienyl]-oxirane | CHEMBL63335
Type:
Small organic molecule
Emp. Form.:
C28H48OS
Mol. Mass.:
432.745
SMILES:
[#6]\[#6](-[#6])=[#6]\[#6]-[#6]-[#16]-[#6]-[#6]-[#6]\[#6](-[#6])=[#6]\[#6]-[#6]\[#6]=[#6](/[#6])-[#6]-[#6]\[#6]=[#6](/[#6])-[#6]-[#6]-[#6]1-[#8]C1([#6])[#6]
: