Target
Lanosterol synthase
Ligand
BDBM50055639
Substrate
Meas. Tech.
ChEMBL_148907 (CHEMBL756144)
IC50
110±n/a nM
Citation
 Stach, DZheng, YFPerez, ALOehlschlager, ACAbe, IPrestwich, GDHartman, PG Synthesis and inhibition studies of sulfur-substituted squalene oxide analogues as mechanism-based inhibitors of 2,3-oxidosqualene-lanosterol cyclase. J Med Chem 40:201-9 (1997)  
Target
Name:
Lanosterol synthase
Synonyms:
LSS_RAT Osc
Type:
PROTEIN
Mol. Mass.:
83302.12
Organism:
Rattus norvegicus
Description:
ChEMBL_12083
Residue:
733
  
Inhibitor
Name:
BDBM50055639
Synonyms:
2-Methyl-2-(4-methyl-pent-3-enyl)-3-[(3E,7E)-3,8,12-trimethyl-14-(3-methyl-oxiranyl)-tetradeca-3,7-dienyl]-oxirane | CHEMBL65573
Type:
Small organic molecule
Emp. Form.:
C29H50O2
Mol. Mass.:
430.7061
SMILES:
[#6]-[#6](-[#6]-[#6]-[#6]\[#6](-[#6])=[#6]\[#6]-[#6]\[#6]=[#6](/[#6])-[#6]-[#6]-[#6]1-[#8]C1([#6])[#6]-[#6]\[#6]=[#6](/[#6])-[#6])-[#6]-[#6]-[#6]-1-[#8]-[#6]-1-[#6]
: