Target
Lanosterol synthase
Ligand
BDBM50055640
Substrate
Meas. Tech.
ChEMBL_148904 (CHEMBL756758)
Ki
4500±n/a nM
Citation
 Stach, DZheng, YFPerez, ALOehlschlager, ACAbe, IPrestwich, GDHartman, PG Synthesis and inhibition studies of sulfur-substituted squalene oxide analogues as mechanism-based inhibitors of 2,3-oxidosqualene-lanosterol cyclase. J Med Chem 40:201-9 (1997)  
Target
Name:
Lanosterol synthase
Synonyms:
LSS_RAT Osc
Type:
PROTEIN
Mol. Mass.:
83302.12
Organism:
Rattus norvegicus
Description:
ChEMBL_12083
Residue:
733
  
Inhibitor
Name:
BDBM50055640
Synonyms:
3-[(3E,7E)-11-((E)-4,8-Dimethyl-nona-3,7-dienylsulfanyl)-3,7-dimethyl-undeca-3,7-dienyl]-2,2-dimethyl-oxirane | CHEMBL66527
Type:
Small organic molecule
Emp. Form.:
C28H48OS
Mol. Mass.:
432.745
SMILES:
[#6]\[#6](-[#6])=[#6]\[#6]-[#6]\[#6](-[#6])=[#6]\[#6]-[#6]-[#16]-[#6]-[#6]-[#6]\[#6]=[#6](/[#6])-[#6]-[#6]\[#6]=[#6](/[#6])-[#6]-[#6]-[#6]1-[#8]C1([#6])[#6]
: