Target
Lanosterol synthase
Ligand
BDBM50055643
Substrate
Meas. Tech.
ChEMBL_148888 (CHEMBL758669)
IC50
540±n/a nM
Citation
 Stach, DZheng, YFPerez, ALOehlschlager, ACAbe, IPrestwich, GDHartman, PG Synthesis and inhibition studies of sulfur-substituted squalene oxide analogues as mechanism-based inhibitors of 2,3-oxidosqualene-lanosterol cyclase. J Med Chem 40:201-9 (1997)  
Target
Name:
Lanosterol synthase
Synonyms:
2,3-epoxysqualene--lanosterol cyclase LSS_HUMAN Oxidosqualene--lanosterol cyclase
Type:
PROTEIN
Mol. Mass.:
83309.32
Organism:
Homo sapiens (Human)
Description:
ChEMBL_11231
Residue:
732
  
Inhibitor
Name:
BDBM50055643
Synonyms:
2,2-Dimethyl-3-[(E)-3-methyl-7-((3E,7E)-4,8,12-trimethyl-trideca-3,7,11-trienylsulfanyl)-oct-3-enyl]-oxirane | CHEMBL64906
Type:
Small organic molecule
Emp. Form.:
C29H50OS
Mol. Mass.:
446.772
SMILES:
[#6]-[#6](-[#6]-[#6]\[#6]=[#6](/[#6])-[#6]-[#6]-[#6]1-[#8]C1([#6])[#6])-[#16]-[#6]-[#6]\[#6]=[#6](/[#6])-[#6]-[#6]\[#6]=[#6](/[#6])-[#6]-[#6]\[#6]=[#6](\[#6])-[#6]
: